maven


Have err when mvn -Prelease-all -DskipTests clean install -U


Problem as title says
the RocketMQ version i use is incubator-rocketmq-release-4.0.0-incubating
downloading from https://github.com/apache/incubator-rocketmq/tree/release-4.0.0-incubating
it has some err when mvn -Prelease-all -DskipTests clean install -U
[INFO] Scanning for projects...
[INFO] ------------------------------------------------------------------------
[INFO] Reactor Build Order:
[INFO]
[INFO] Apache RocketMQ 4.1.0-incubating-SNAPSHOT
[INFO] rocketmq-remoting 4.1.0-incubating-SNAPSHOT
[INFO] rocketmq-common 4.1.0-incubating-SNAPSHOT
[INFO] rocketmq-client 4.1.0-incubating-SNAPSHOT
[INFO] rocketmq-store 4.1.0-incubating-SNAPSHOT
[INFO] rocketmq-srvutil 4.1.0-incubating-SNAPSHOT
[INFO] rocketmq-broker 4.1.0-incubating-SNAPSHOT
[INFO] rocketmq-tools 4.1.0-incubating-SNAPSHOT
[INFO] rocketmq-namesrv 4.1.0-incubating-SNAPSHOT
[INFO] rocketmq-example 4.1.0-incubating-SNAPSHOT
[INFO] rocketmq-filtersrv 4.1.0-incubating-SNAPSHOT
[INFO] rocketmq-test 4.1.0-incubating-SNAPSHOT
[INFO]
[INFO] ------------------------------------------------------------------------
[INFO] Building Apache RocketMQ 4.1.0-incubating-SNAPSHOT 4.1.0-incubating-SNAPSHOT
[INFO] ------------------------------------------------------------------------
[INFO]
[INFO] --- maven-clean-plugin:3.0.0:clean (default-clean) # rocketmq-all ---
[INFO]
[INFO] --- maven-enforcer-plugin:1.4.1:enforce (enforce-ban-circular-dependencies) # rocketmq-all ---
[INFO]
[INFO] --- jacoco-maven-plugin:0.7.8:prepare-agent (default-prepare-agent) # rocketmq-all ---
[INFO] argLine set to -javaagent:/home/alex/.m2/repository/org/jacoco/org.jacoco.agent/0.7.8/org.jacoco.agent-0.7.8-runtime.jar=destfile=/usr/local/rocketMQ/incubator-rocketmq-release-4.0.0-incubating/target/jacoco.exec
[INFO]
[INFO] --- maven-remote-resources-plugin:1.5:process (process-resource-bundles) # rocketmq-all ---
[INFO] ------------------------------------------------------------------------
[INFO] Reactor Summary:
[INFO]
[INFO] Apache RocketMQ 4.1.0-incubating-SNAPSHOT .......... FAILURE [ 2.688 s]
[INFO] rocketmq-remoting 4.1.0-incubating-SNAPSHOT ........ SKIPPED
[INFO] rocketmq-common 4.1.0-incubating-SNAPSHOT .......... SKIPPED
[INFO] rocketmq-client 4.1.0-incubating-SNAPSHOT .......... SKIPPED
[INFO] rocketmq-store 4.1.0-incubating-SNAPSHOT ........... SKIPPED
[INFO] rocketmq-srvutil 4.1.0-incubating-SNAPSHOT ......... SKIPPED
[INFO] rocketmq-broker 4.1.0-incubating-SNAPSHOT .......... SKIPPED
[INFO] rocketmq-tools 4.1.0-incubating-SNAPSHOT ........... SKIPPED
[INFO] rocketmq-namesrv 4.1.0-incubating-SNAPSHOT ......... SKIPPED
[INFO] rocketmq-example 4.1.0-incubating-SNAPSHOT ......... SKIPPED
[INFO] rocketmq-filtersrv 4.1.0-incubating-SNAPSHOT ....... SKIPPED
[INFO] rocketmq-test 4.1.0-incubating-SNAPSHOT ............ SKIPPED
[INFO] ------------------------------------------------------------------------
[INFO] BUILD FAILURE
[INFO] ------------------------------------------------------------------------
[INFO] Total time: 3.335 s
[INFO] Finished at: 2017-05-10T14:49:16+08:00
[INFO] Final Memory: 15M/43M
[INFO] ------------------------------------------------------------------------
[ERROR] Failed to execute goal org.apache.maven.plugins:maven-remote-resources-plugin:1.5:process (process-resource-bundles) on project rocketmq-all: Error finding remote resources manifests: /usr/local/rocketMQ/incubator-rocketmq-release-4.0.0-incubating/target/maven-shared-archive-resources/META-INF/NOTICE (No such file or directory) -> [Help 1]
[ERROR]
[ERROR] To see the full stack trace of the errors, re-run Maven with the -e switch.
[ERROR] Re-run Maven using the -X switch to enable full debug logging.
[ERROR]
[ERROR] For more information about the errors and possible solutions, please read the following articles:
[ERROR] [Help 1] http://cwiki.apache.org/confluence/display/MAVEN/MojoExecutionException
[ERROR] Failed to execute goal org.apache.maven.plugins:maven-remote-resources-plugin:1.5:process (process-resource-bundles) on project rocketmq-all: Error finding remote resources manifests: /usr/local/rocketMQ/incubator-rocketmq-release-4.0.0-incubating/target/maven-shared-archive-resources/META-INF/NOTICE (No such file or directory) -> [Help 1]
org.apache.maven.lifecycle.LifecycleExecutionException: Failed to execute goal org.apache.maven.plugins:maven-remote-resources-plugin:1.5:process (process-resource-bundles) on project rocketmq-all: Error finding remote resources manifests
at org.apache.maven.lifecycle.internal.MojoExecutor.execute(MojoExecutor.java:212)
at org.apache.maven.lifecycle.internal.MojoExecutor.execute(MojoExecutor.java:153)
at org.apache.maven.lifecycle.internal.MojoExecutor.execute(MojoExecutor.java:145)
at org.apache.maven.lifecycle.internal.LifecycleModuleBuilder.buildProject(LifecycleModuleBuilder.java:116)
at org.apache.maven.lifecycle.internal.LifecycleModuleBuilder.buildProject(LifecycleModuleBuilder.java:80)
at org.apache.maven.lifecycle.internal.builder.singlethreaded.SingleThreadedBuilder.build(SingleThreadedBuilder.java:51)
at org.apache.maven.lifecycle.internal.LifecycleStarter.execute(LifecycleStarter.java:128)
at org.apache.maven.DefaultMaven.doExecute(DefaultMaven.java:307)
at org.apache.maven.DefaultMaven.doExecute(DefaultMaven.java:193)
at org.apache.maven.DefaultMaven.execute(DefaultMaven.java:106)
at org.apache.maven.cli.MavenCli.execute(MavenCli.java:863)
at org.apache.maven.cli.MavenCli.doMain(MavenCli.java:288)
at org.apache.maven.cli.MavenCli.main(MavenCli.java:199)
at sun.reflect.NativeMethodAccessorImpl.invoke0(Native Method)
at sun.reflect.NativeMethodAccessorImpl.invoke(NativeMethodAccessorImpl.java:62)
at sun.reflect.DelegatingMethodAccessorImpl.invoke(DelegatingMethodAccessorImpl.java:43)
at java.lang.reflect.Method.invoke(Method.java:498)
at org.codehaus.plexus.classworlds.launcher.Launcher.launchEnhanced(Launcher.java:289)
at org.codehaus.plexus.classworlds.launcher.Launcher.launch(Launcher.java:229)
at org.codehaus.plexus.classworlds.launcher.Launcher.mainWithExitCode(Launcher.java:415)
at org.codehaus.plexus.classworlds.launcher.Launcher.main(Launcher.java:356)
Caused by: org.apache.maven.plugin.MojoExecutionException: Error finding remote resources manifests
at org.apache.maven.plugin.resources.remote.ProcessRemoteResourcesMojo.processResourceBundles(ProcessRemoteResourcesMojo.java:1238)
at org.apache.maven.plugin.resources.remote.ProcessRemoteResourcesMojo.execute(ProcessRemoteResourcesMojo.java:520)
at org.apache.maven.plugin.DefaultBuildPluginManager.executeMojo(DefaultBuildPluginManager.java:134)
at org.apache.maven.lifecycle.internal.MojoExecutor.execute(MojoExecutor.java:207)
... 20 more
Caused by: java.io.FileNotFoundException: /usr/local/rocketMQ/incubator-rocketmq-release-4.0.0-incubating/target/maven-shared-archive-resources/META-INF/NOTICE (No such file or directory)
at java.io.FileOutputStream.open0(Native Method)
at java.io.FileOutputStream.open(FileOutputStream.java:270)
at java.io.FileOutputStream.<init>(FileOutputStream.java:213)
at java.io.FileOutputStream.<init>(FileOutputStream.java:162)
at java.io.FileWriter.<init>(FileWriter.java:90)
at org.apache.maven.plugin.resources.remote.ProcessRemoteResourcesMojo.processResourceBundles(ProcessRemoteResourcesMojo.java:1146)
... 23 more

Related Links

How to specify active profiles in Maven3
Using Jenkins and Maven post build process fails to deploy .zip files
Maven Checkstyle Site
Maven - How to compile tests without running them ?
maven axis2 java2wsdl sun.net.util.URLUtil.urlNoFragString error
In the Maven Standard Directory Layout where do I put Rules Engine files?
How to launch jython console from maven
Only create executable jar-with-dependencies in Maven
Maven release setup with svn tags per module
Maven: how to get a war package with resources copied in WEB-INF?
How to use auto generated code in Maven project
Is there a way to exclude a Maven dependency globally?
maven scm url generate
creating war file using maven-ear-plugin and defining it in one pom.xml
Automating Maven Settings file
RCP build with maven

Categories

HOME
listview
mediawiki
push-notification
tinymce
nullpointerexception
jgroups
opengl-es-2.0
django-imagekit
android-youtube-api
facebook-php-sdk
ssl-client-authentication
node-pdfkit
size
quickfix
ups
after-effects
invantive-sql
nhibernate-envers
karma-jasmine
ml
shopware
numerical-methods
apache-commons-io
dynamic-featured-image
brunch
tooltipster
minitab
typo3-6.2.x
opentype
webkitspeechrecognition
sql-server-2012-express
google-cloud-endpoints-v2
repo
bower-install
restlet
event-driven
sharefile
unspecified
elasticsearch-plugin
dynamic-reports
texmaker
powershell-dsc
password-encryption
no-www
outlook-api
skeleton-css-boilerplate
flickr-api
youcompleteme
paxos
boost-multi-index
python-webbrowser
statsd
forever
pg-dump
typed-lambda-calculus
hittest
bind9
sonarlint-vs
or-tools
color-picker
google-feed-api
dstu2-fhir
transmitfile
plottable.js
gridview-sorting
react-native-listview
pickadate
tform
wapiti
tcpserver
lib.web.mvc
wireshark-dissector
dundas
gwidgets
oxwall
winddk
titanium-modules
android-radiobutton
expected-exception
comexception
marmalade
apc
whoosh
disclosure
sudzc
gamequery
routedevent
dbal
brewmp
private-members
multiple-languages

Resources

Encrypt Message



code
soft
python
ios
c
html
jquery
cloud
mobile